Reaction Details
TargetAlkaline phosphatase, germ cell type
LigandBDBM76222
Substrate/Competitorn/a
Meas. Tech.Dose Response confirmation of uHTS inhibitors of Mouse Intestinal Alkaline Phosphatase using Placental Alkaline Phosphatase
IC50>100000±n/a nM
Citation PubChem, PC Dose Response confirmation of uHTS inhibitors of Mouse Intestinal Alkaline Phosphatase using Placental Alkaline Phosphatase PubChem Bioassay(2010)[AID]
 
Alkaline phosphatase, germ cell type
Name:Alkaline phosphatase, germ cell type
Type:PROTEIN
Mol. Mass.:57374.31
Organism:Homo sapiens (Human)
Description:ChEMBL_29964
Residue:532
BDBM76222
NameBDBM76222
Synonyms:MLS001072174 N-[3-(3-chlorophenyl)phenyl]-1-[(1-ethyl-3,5-dimethyl-pyrazol-4-yl)methyl]isonipecotamide N-[3-(3-chlorophenyl)phenyl]-1-[(1-ethyl-3,5-dimethylpyrazol-4-yl)methyl]piperidine-4-carboxamide cid_24816640
TypeSmall organic molecule
Emp. Form.C26H31ClN4O
Mol. Mass.451.004
SMILESCCn1nc(C)c(CN2CCC(CC2)C(=O)Nc2cccc(c2)-c2cccc(Cl)c2)c1C