Reaction Details
TargetAlkaline phosphatase, tissue-nonspecific isozyme
LigandBDBM75613
Substrate/Competitorn/a
Meas. Tech.Dose Response confirmation of uHTS activators of Human Intestinal Alkaline Phosphatase using Tissue Nonspecific Alkaline Phosphatase.
EC50 2410±n/a nM
Citation PubChem, PC Dose Response confirmation of uHTS activators of Human Intestinal Alkaline Phosphatase using Tissue Nonspecific Alkaline Phosphatase. PubChem Bioassay(2010)[AID]
 
Alkaline phosphatase, tissue-nonspecific isozyme
Name:Alkaline phosphatase, tissue-nonspecific isozyme
Type:PROTEIN
Mol. Mass.:57306.17
Organism:Homo sapiens (Human)
Description:ChEMBL_1448917
Residue:524
BDBM75613
NameBDBM75613
Synonyms:(2Z)-9-(3-chlorophenyl)-2-(5-ethoxy-6-keto-cyclohexa-2,4-dien-1-ylidene)-8-keto-1,7-dihydropurine-6-carboxamide (2Z)-9-(3-chlorophenyl)-2-(5-ethoxy-6-oxo-1-cyclohexa-2,4-dienylidene)-8-oxo-1,7-dihydropurine-6-carboxamide MLS000102658 cid_6324587
TypeSmall organic molecule
Emp. Form.C20H16ClN5O4
Mol. Mass.425.825
SMILESCCOc1cccc(c1O)-c1nc(C(N)=O)c2[nH]c(=O)n(-c3cccc(Cl)c3)c2n1