Reaction Details
TargetAlkaline phosphatase, tissue-nonspecific isozyme
LigandBDBM43816
Substrate/Competitorn/a
Meas. Tech.Dose Response confirmation of uHTS activators of Human Intestinal Alkaline Phosphatase using Tissue Nonspecific Alkaline Phosphatase.
EC50 454±n/a nM
Citation PubChem, PC Dose Response confirmation of uHTS activators of Human Intestinal Alkaline Phosphatase using Tissue Nonspecific Alkaline Phosphatase. PubChem Bioassay(2010)[AID]
 
Alkaline phosphatase, tissue-nonspecific isozyme
Name:Alkaline phosphatase, tissue-nonspecific isozyme
Type:PROTEIN
Mol. Mass.:57306.17
Organism:Homo sapiens (Human)
Description:ChEMBL_1448917
Residue:524
BDBM43816
NameBDBM43816
Synonyms:5'-bromanylspiro[1,2-dihydro-4,1,2-benzoxadiazine-3,3'-1H-indole]-2'-one 5'-bromospiro[1,2-dihydro-4,1,2-benzoxadiazine-3,3'-1H-indole]-2'-one MLS-0258268.0001 | cid_4879298
TypeSmall organic molecule
Emp. Form.C14H10BrN3O2
Mol. Mass.332.152
SMILESBrc1ccc2NC(=O)C3(NNc4ccccc4O3)c2c1