Reaction Details
TargetAlkaline phosphatase, tissue-nonspecific isozyme
LigandBDBM75701
Substrate/Competitorn/a
Meas. Tech.Dose Response confirmation of uHTS activators of Human Intestinal Alkaline Phosphatase using Tissue Nonspecific Alkaline Phosphatase.
EC50 705±n/a nM
Citation PubChem, PC Dose Response confirmation of uHTS activators of Human Intestinal Alkaline Phosphatase using Tissue Nonspecific Alkaline Phosphatase. PubChem Bioassay(2010)[AID]
 
Alkaline phosphatase, tissue-nonspecific isozyme
Name:Alkaline phosphatase, tissue-nonspecific isozyme
Type:PROTEIN
Mol. Mass.:57306.17
Organism:Homo sapiens (Human)
Description:ChEMBL_1448917
Residue:524
BDBM75701
NameBDBM75701
Synonyms:3-[[(2-hydroxybenzoyl)amino]carbamoyl]-N-(3-methylphenyl)benzenesulfonamide 3-[[[(2-hydroxyphenyl)-oxomethyl]hydrazo]-oxomethyl]-N-(3-methylphenyl)benzenesulfonamide N-(m-tolyl)-3-[(salicyloylamino)carbamoyl]benzenesulfonamide cid_25163558
TypeSmall organic molecule
Emp. Form.C21H19N3O5S
Mol. Mass.425.458
SMILESCc1cccc(NS(=O)(=O)c2cccc(c2)C(=O)NNC(=O)c2ccccc2O)c1