Reaction Details
TargetAlkaline phosphatase, germ cell type
LigandBDBM75692
Substrate/Competitorn/a
Meas. Tech.Dose Response confirmation of uHTS activators of Human Intestinal Alkaline Phosphatase using Placental Alkaline Phosphatase
EC50 9190±n/a nM
Citation PubChem, PC Dose Response confirmation of uHTS activators of Human Intestinal Alkaline Phosphatase using Placental Alkaline Phosphatase PubChem Bioassay(2010)[AID]
 
Alkaline phosphatase, germ cell type
Name:Alkaline phosphatase, germ cell type
Type:PROTEIN
Mol. Mass.:57374.31
Organism:Homo sapiens (Human)
Description:ChEMBL_29964
Residue:532
BDBM75692
NameBDBM75692
Synonyms:MLS001235951 N'-[1-(3-methylphenyl)pyrazolo[3,4-d]pyrimidin-4-yl]furan-2-carbohydrazide SMR000807172 | cid_8489109
TypeSmall organic molecule
Emp. Form.C17H14N6O2
Mol. Mass.334.3321
SMILESCc1cccc(c1)-n1ncc2c(NNC(=O)c3ccco3)ncnc12