Reaction Details
TargetAlkaline phosphatase, germ cell type
LigandBDBM50248691
Substrate/Competitorn/a
Meas. Tech.Dose Response confirmation of uHTS inhibitors of Human Intestinal Alkaline Phosphatase using Placental Alkaline Phosphatase
IC50 2710±n/a nM
Citation PubChem, PC Dose Response confirmation of uHTS inhibitors of Human Intestinal Alkaline Phosphatase using Placental Alkaline Phosphatase PubChem Bioassay(2010)[AID]
 
Alkaline phosphatase, germ cell type
Name:Alkaline phosphatase, germ cell type
Type:PROTEIN
Mol. Mass.:57374.31
Organism:Homo sapiens (Human)
Description:ChEMBL_29964
Residue:532
BDBM50248691
NameBDBM50248691
Synonyms:(1S)-1,5-anhydro-1-(1,3,6,7-tetrahydroxy-9-oxo-9H-xanthen-2-yl)-D-glucitol cid_5358385 | mangiferin
TypeSmall organic molecule
Emp. Form.C19H18O11
Mol. Mass.422.3396
SMILESOC[C@H]1O[C@H]([C@H](O)[C@@H](O)[C@@H]1O)c1c(O)cc2oc3cc(O)c(O)cc3c(=O)c2c1O