Reaction Details
TargetCaspase-3
LigandBDBM48039
Substrate/Competitorn/a
Meas. Tech.Dose Response confirmation of inhibitors of Sentrin-specific proteases (SENPs) using a Caspase-3 Selectivity assay
IC50 11200±n/a nM
Citation PubChem, PC Dose Response confirmation of inhibitors of Sentrin-specific proteases (SENPs) using a Caspase-3 Selectivity assay PubChem Bioassay(2010)[AID]
 
Caspase-3
Name:Caspase-3
Type:Hydrolase; heterotetramer of two heterodimers
Mol. Mass.:31607.55
Organism:Homo sapiens (Human)
Description:n/a
Residue:277
BDBM48039
NameBDBM48039
Synonyms:3-[[(4E)-4-(2,4-dimethylphenyl)sulfonylimino-1-keto-2-naphthyl]amino]benzoic acid 3-[[(4E)-4-(2,4-dimethylphenyl)sulfonylimino-1-oxo-2-naphthalenyl]amino]benzoic acid MLS000948061 cid_5824726
TypeSmall organic molecule
Emp. Form.C25H20N2O5S
Mol. Mass.460.502
SMILESCc1ccc(c(C)c1)S(=O)(=O)N=C1C=C(Nc2cccc(c2)C(O)=O)C(=O)c2ccccc12