Reaction Details
TargetEpidermal growth factor receptor [T790M]
LigandBDBM149404
Substrate/Competitorn/a
Meas. Tech.TBD
IC50 412±n/a nM
Citation Hu, SLiu, XBai, JLong, W Protein tyrosine kinase modulators and methods of use US Patent US10059688 Publication Date 8/28/2018
 
Epidermal growth factor receptor [T790M]
Name:Epidermal growth factor receptor [T790M]
Type:Enzyme
Mol. Mass.:134309.68
Organism:Homo sapiens (Human)
Description:P00533 (T790M)
Residue:1210
BDBM149404
NameBDBM149404
Synonyms:AVL-301 CNX-419 Rociletinib US10167264, Compound CO-1686 US10434101, Compound I-4 US8975249, I-4 | US9783524, CO-1686
TypeSmall organic molecule
Emp. Form.C27H28F3N7O3
Mol. Mass.555.5515
SMILESCOc1cc(ccc1Nc1ncc(c(Nc2cccc(NC(=O)C=C)c2)n1)C(F)(F)F)N1CCN(CC1)C(C)=O