Reaction Details
TargetAlkaline phosphatase, tissue-nonspecific isozyme
LigandBDBM50710
Substrate/Competitorn/a
Meas. Tech.Dose Response confirmation of uHTS inhibitors of Mouse Intestinal Alkaline Phosphatase using Tissue Nonspecific Alkaline Phosphatase.
IC50>100000±n/a nM
Citation PubChem, PC Dose Response confirmation of uHTS inhibitors of Mouse Intestinal Alkaline Phosphatase using Tissue Nonspecific Alkaline Phosphatase. PubChem Bioassay(2010)[AID]
 
Alkaline phosphatase, tissue-nonspecific isozyme
Name:Alkaline phosphatase, tissue-nonspecific isozyme
Type:PROTEIN
Mol. Mass.:57306.17
Organism:Homo sapiens (Human)
Description:ChEMBL_1448917
Residue:524
BDBM50710
NameBDBM50710
Synonyms:2-(3,4-dihydroxyphenyl)-7,8-dihydroxy-2,3-dihydrochromen-4-one 2-(3,4-dihydroxyphenyl)-7,8-dihydroxy-chroman-4-one MLS000863589 cid_12309904
TypeSmall organic molecule
Emp. Form.C15H12O6
Mol. Mass.288.2522
SMILESOc1ccc(cc1O)C1CC(=O)c2ccc(O)c(O)c2O1