Reaction Details
TargetAlkaline phosphatase, tissue-nonspecific isozyme
LigandBDBM75309
Substrate/Competitorn/a
Meas. Tech.Dose Response confirmation of uHTS inhibitors of Mouse Intestinal Alkaline Phosphatase using Tissue Nonspecific Alkaline Phosphatase.
IC50 74800±n/a nM
Citation PubChem, PC Dose Response confirmation of uHTS inhibitors of Mouse Intestinal Alkaline Phosphatase using Tissue Nonspecific Alkaline Phosphatase. PubChem Bioassay(2010)[AID]
 
Alkaline phosphatase, tissue-nonspecific isozyme
Name:Alkaline phosphatase, tissue-nonspecific isozyme
Type:PROTEIN
Mol. Mass.:57306.17
Organism:Homo sapiens (Human)
Description:ChEMBL_1448917
Residue:524
BDBM75309
NameBDBM75309
Synonyms:(2Z)-3-ethyl-2-[(E)-3-(3-ethyl-1,3-benzothiazol-3-ium-2-yl)prop-2-enylidene]-1,3-benzothiazole;iodide MLS001032120 cid_5709759
TypeSmall organic molecule
Emp. Form.C21H21N2S2
Mol. Mass.365.534
SMILESCCN1\C(Sc2ccccc12)=C\C=C\c1sc2ccccc2[n+]1CC