Reaction Details
TargetVoltage-dependent T-type calcium channel subunit alpha-1H
LigandBDBM39693
Substrate/Competitorn/a
Meas. Tech.Inhibitors of T-Type Calcium Channel
EC50 4940±0 nM
Citation PubChem, PC Inhibitors of T-Type Calcium Channel PubChem Bioassay(2010)[AID]
 
Voltage-dependent T-type calcium channel subunit alpha-1H
Name:Voltage-dependent T-type calcium channel subunit alpha-1H
Type:Enzyme Catalytic Domain
Mol. Mass.:259187.68
Organism:Homo sapiens (Human)
Description:Calcium channel (Type T,L) 0 0::O95180
Residue:2353
BDBM39693
NameBDBM39693
Synonyms:1-[2-(diethylamino)ethyl]-N-[[1-(phenylmethyl)-2-benzimidazolyl]methyl]-2-benzimidazolamine 2-[2-[(1-benzylbenzimidazol-2-yl)methylamino]benzimidazol-1-yl]ethyl-diethyl-amine N-[(1-benzyl-1H-benzimidazol-2-yl)methyl]-1-[2-(diethylamino)ethyl]-1H-benzimidazol-2-amine SMR000140572 | cid_1253120
TypeSmall organic molecule
Emp. Form.C28H32N6
Mol. Mass.452.5939
SMILESCCN(CC)CCn1c(NCc2nc3ccccc3n2Cc2ccccc2)nc2ccccc12