Reaction Details
TargetProtein RecA
LigandBDBM43224
Substrate/Competitorn/a
Meas. Tech.Intein inhibitors as potential Tuberculosis drugs
IC50 6390±n/a nM
Citation PubChem, PC Intein inhibitors as potential Tuberculosis drugs PubChem Bioassay(2010)[AID]
 
Protein RecA
Name:Protein RecA
Type:Enzyme Catalytic Domain
Mol. Mass.:85386.52
Organism:Mycobacterium tuberculosis H37Rv
Description:gi_15609874
Residue:790
BDBM43224
NameBDBM43224
Synonyms:1-ethyl-6-methyl-3-[(E)-2-phenylethenyl]pyrimido[5,4-e][1,2,4]triazine-5,7-dione MLS000717146 US9073941, 609 | cid_5756371
TypeSmall organic molecule
Emp. Form.C16H15N5O2
Mol. Mass.309.3226
SMILESCCn1nc(\C=C\c2ccccc2)nc2c1nc(=O)n(C)c2=O