Reaction Details
TargetCaspase-7
LigandBDBM77499
Substrate/Competitorn/a
Meas. Tech.Counterscreen for procaspase-3 activators: absorbance-based biochemical high throughput dose response assay for activators of procaspase-7
EC50 9486±n/a nM
Citation PubChem, PC Counterscreen for procaspase-3 activators: absorbance-based biochemical high throughput dose response assay for activators of procaspase-7 PubChem Bioassay(2010)[AID]
 
Caspase-7
Name:Caspase-7
Type:Enzyme
Mol. Mass.:34273.91
Organism:Homo sapiens (Human)
Description:P55210
Residue:303
BDBM77499
NameBDBM77499
Synonyms:2-(2-Methoxy-phenylamino)-8-methyl-quinoline-3-carbonitrile 2-(2-methoxyanilino)-8-methylquinoline-3-carbonitrile 8-methyl-2-(o-anisidino)quinoline-3-carbonitrile SMR000172503 | cid_865262
TypeSmall organic molecule
Emp. Form.C18H15N3O
Mol. Mass.289.3312
SMILESCOc1ccccc1Nc1nc2c(C)cccc2cc1C#N