Reaction Details
TargetProtein-arginine deiminase type-4
LigandBDBM50085363
Substrate/Competitorn/a
Meas. Tech.Fluorescence-based biochemical dose response assay to identify inhibitors of Protein Arginine Deiminase 4 (PAD4)
IC50 13000±n/a nM
Citation PubChem, PC Fluorescence-based biochemical dose response assay to identify inhibitors of Protein Arginine Deiminase 4 (PAD4) PubChem Bioassay(2010)[AID]
 
Protein-arginine deiminase type-4
Name:Protein-arginine deiminase type-4
Type:Enzyme Catalytic Domain
Mol. Mass.:74078.90
Organism:Homo sapiens (Human)
Description:gi_216548487
Residue:663
BDBM50085363
NameBDBM50085363
Synonyms:CHEMBL60718 N-Tosyl-L-phenylalanine chloromethyl ketone N-[(2S)-4-chloro-3-oxo-1-phenylbutan-2-yl]-4-methylbenzenesulfonamide Tos-Phe-CH2Cl cid_439647 | l-N-(alpha-(Chloroacetyl)phenethyl)-p-toluenesulfonamide
TypeSmall organic molecule
Emp. Form.C17H18ClNO3S
Mol. Mass.351.848
SMILESCc1ccc(cc1)S(=O)(=O)N[C@@H](Cc1ccccc1)C(=O)CCl