Reaction Details
TargetProtein-arginine deiminase type-4
LigandBDBM51771
Substrate/Competitorn/a
Meas. Tech.Fluorescence-based biochemical dose response assay to identify inhibitors of Protein Arginine Deiminase 4 (PAD4)
IC50 21000±n/a nM
Citation PubChem, PC Fluorescence-based biochemical dose response assay to identify inhibitors of Protein Arginine Deiminase 4 (PAD4) PubChem Bioassay(2010)[AID]
 
Protein-arginine deiminase type-4
Name:Protein-arginine deiminase type-4
Type:Enzyme Catalytic Domain
Mol. Mass.:74078.90
Organism:Homo sapiens (Human)
Description:gi_216548487
Residue:663
BDBM51771
NameBDBM51771
Synonyms:1,6-dimethyl-3-(2-pyridinyl)pyrimido[5,4-e][1,2,4]triazine-5,7(1H,6H)-dione 1,6-dimethyl-3-(2-pyridyl)pyrimido[5,4-e][1,2,4]triazine-5,7-quinone 1,6-dimethyl-3-pyridin-2-ylpyrimido[5,4-e][1,2,4]triazine-5,7-dione SMR000291658 | cid_906542
TypeSmall organic molecule
Emp. Form.C12H10N6O2
Mol. Mass.270.2468
SMILESCn1nc(nc2c1nc(=O)n(C)c2=O)-c1ccccn1