Reaction Details
TargetMitochondrial import inner membrane translocase subunit TIM10
LigandBDBM34233
Substrate/Competitorn/a
Meas. Tech.Dose Response confirmation of uHTS small molecule inhibitors of tim10-1 yeast via a luminescent assay
IC50 10000±n/a nM
Citation PubChem, PC Dose Response confirmation of uHTS small molecule inhibitors of tim10-1 yeast via a luminescent assay PubChem Bioassay(2010)[AID]
 
Mitochondrial import inner membrane translocase subunit TIM10
Name:Mitochondrial import inner membrane translocase subunit TIM10
Type:Enzyme Catalytic Domain
Mol. Mass.:10303.50
Organism:Saccharomyces cerevisiae S288c
Description:gi_285809906
Residue:93
BDBM34233
NameBDBM34233
Synonyms:2-Phenyl-benzo[d]isoselenazol-3-one 2-phenyl-1,2-benzisoselazol-3(2H)-one 2-phenylbenzo[d][1,2]selenazol-3(2H)-one EBSELEN MLS000028488 cid_3194 | med.21724, Compound 153
TypeSmall organic molecule
Emp. Form.C13H9NOSe
Mol. Mass.274.18
SMILESO=c1n([se]c2ccccc12)-c1ccccc1