Reaction Details
TargetMitochondrial import inner membrane translocase subunit TIM10
LigandBDBM66036
Substrate/Competitorn/a
Meas. Tech.Dose Response confirmation of uHTS small molecule inhibitors of tim10-1 yeast via a luminescent assay
IC50 7820±n/a nM
Citation PubChem, PC Dose Response confirmation of uHTS small molecule inhibitors of tim10-1 yeast via a luminescent assay PubChem Bioassay(2010)[AID]
 
Mitochondrial import inner membrane translocase subunit TIM10
Name:Mitochondrial import inner membrane translocase subunit TIM10
Type:Enzyme Catalytic Domain
Mol. Mass.:10303.50
Organism:Saccharomyces cerevisiae S288c
Description:gi_285809906
Residue:93
BDBM66036
NameBDBM66036
Synonyms:MLS000054763 N-(oxolan-2-ylmethyl)-2-(trifluoromethylsulfonyl)-N-[2-(trifluoromethylsulfonyl)ethyl]ethanamine cid_2998156 | tetrahydrofurfuryl-bis(2-triflylethyl)amine
TypeSmall organic molecule
Emp. Form.C11H17F6NO5S2
Mol. Mass.421.377
SMILESFC(F)(F)S(=O)(=O)CCN(CCS(=O)(=O)C(F)(F)F)CC1CCCO1