Reaction Details
TargetMitochondrial import inner membrane translocase subunit TIM10
LigandBDBM78304
Substrate/Competitorn/a
Meas. Tech.Dose Response confirmation of uHTS small molecule inhibitors of tim10-1 yeast via a luminescent assay
IC50 68300±n/a nM
Citation PubChem, PC Dose Response confirmation of uHTS small molecule inhibitors of tim10-1 yeast via a luminescent assay PubChem Bioassay(2010)[AID]
 
Mitochondrial import inner membrane translocase subunit TIM10
Name:Mitochondrial import inner membrane translocase subunit TIM10
Type:Enzyme Catalytic Domain
Mol. Mass.:10303.50
Organism:Saccharomyces cerevisiae S288c
Description:gi_285809906
Residue:93
BDBM78304
NameBDBM78304
Synonyms:2-(2-hydroxy-5-prop-2-enylphenyl)-4-prop-2-enylphenol 4-allyl-2-(5-allyl-2-hydroxy-phenyl)phenol SMR000387108 | cid_72300
TypeSmall organic molecule
Emp. Form.C18H18O2
Mol. Mass.266.3343
SMILESOc1ccc(CC=C)cc1-c1cc(CC=C)ccc1O