Reaction Details
TargetBeta-secretase 1
LigandBDBM270568
Substrate/Competitorn/a
Meas. Tech.BACE1 Binding Assay
pH4.5±n/a
Temperature298.15±n/a K
Ki 4.30±n/a nM
Commentsextracted
Citation Juhl, KTagmose, LMarigo, M 2-amino-3,5-difluoro-3,6-dimethyl-6-phenyl-3,4,5,6-tetrahydropyridines as BACE1 inhibitors for treating alzheimer's disease US Patent US10059669 Publication Date 8/28/2018
 
Beta-secretase 1
Name:Beta-secretase 1
Type:Protein
Mol. Mass.:55755.10
Organism:Homo sapiens (Human)
Description:P56817
Residue:501
BDBM270568
NameBDBM270568
Synonyms:N-(3-((2R,3S,5S)-6-amino-3,5-difluoro-2,5-dimethyl-2,3,4,5-tetrahydropyridin-2-yl)-4-fluorophenyl)-5-bromopicolinamide | US10059669, Compound 24
TypeSmall organic molecule
Emp. Form.C19H18BrF3N4O
Mol. Mass.455.272
SMILESC[C@]1(F)C[C@H](F)[C@](C)(N=C1N)c1cc(NC(=O)c2ccc(Br)cn2)ccc1F