Reaction Details
TargetUbiquitin-conjugating enzyme E2 N
LigandBDBM78543
Substrate/Competitorn/a
Meas. Tech.Dose Response confirmation of uHTS for the identification of UBC13 Polyubiquitin Inhibitors via a TR-FRET Assay
IC50 1545±104 nM
Citation PubChem, PC Dose Response confirmation of uHTS for the identification of UBC13 Polyubiquitin Inhibitors via a TR-FRET Assay PubChem Bioassay(2011)[AID]
 
Ubiquitin-conjugating enzyme E2 N
Name:Ubiquitin-conjugating enzyme E2 N
Type:PROTEIN
Mol. Mass.:17137.61
Organism:Homo sapiens (Human)
Description:EBI_101440
Residue:152
BDBM78543
NameBDBM78543
Synonyms:MLS000087827 N-(2-methyl-4-oxo-3-quinazolinyl)-4-propoxybenzamide N-(2-methyl-4-oxoquinazolin-3-yl)-4-propoxybenzamide SMR000024047 | cid_3237593
TypeSmall organic molecule
Emp. Form.C19H19N3O3
Mol. Mass.337.3725
SMILESCCCOc1ccc(cc1)C(=O)Nn1c(C)nc2ccccc2c1=O