Reaction Details
TargetUbiquitin-conjugating enzyme E2 N
LigandBDBM50073568
Substrate/Competitorn/a
Meas. Tech.Dose Response confirmation of uHTS for the identification of UBC13 Polyubiquitin Inhibitors via a TR-FRET Assay
IC50 1496±84 nM
Citation PubChem, PC Dose Response confirmation of uHTS for the identification of UBC13 Polyubiquitin Inhibitors via a TR-FRET Assay PubChem Bioassay(2011)[AID]
 
Ubiquitin-conjugating enzyme E2 N
Name:Ubiquitin-conjugating enzyme E2 N
Type:PROTEIN
Mol. Mass.:17137.61
Organism:Homo sapiens (Human)
Description:EBI_101440
Residue:152
BDBM50073568
NameBDBM50073568
Synonyms:6,7-Dimethoxy-2-piperazin-1-yl-quinazolin-4-ylamine CHEMBL1226 | cid_616267
TypeSmall organic molecule
Emp. Form.C14H19N5O2
Mol. Mass.289.333
SMILESCOc1cc2nc(nc(N)c2cc1OC)N1CCNCC1