Reaction Details
TargetUbiquitin-conjugating enzyme E2 N
LigandBDBM63221
Substrate/Competitorn/a
Meas. Tech.Dose Response confirmation of uHTS for the identification of UBC13 Polyubiquitin Inhibitors via a TR-FRET Assay
IC50 1727±239 nM
Citation PubChem, PC Dose Response confirmation of uHTS for the identification of UBC13 Polyubiquitin Inhibitors via a TR-FRET Assay PubChem Bioassay(2011)[AID]
 
Ubiquitin-conjugating enzyme E2 N
Name:Ubiquitin-conjugating enzyme E2 N
Type:PROTEIN
Mol. Mass.:17137.61
Organism:Homo sapiens (Human)
Description:EBI_101440
Residue:152
BDBM63221
NameBDBM63221
Synonyms:1-[(2-ketoindol-3-yl)amino]-3-(tetrahydrofurfuryl)thiourea 1-[(2-oxo-3-indolyl)amino]-3-(2-oxolanylmethyl)thiourea MLS000590727 cid_6052520
TypeSmall organic molecule
Emp. Form.C14H16N4O2S
Mol. Mass.304.367
SMILESO=C1N=c2ccccc2=C1NNC(=S)NCC1CCCO1