Reaction Details
TargetUbiquitin-conjugating enzyme E2 N
LigandBDBM78848
Substrate/Competitorn/a
Meas. Tech.Dose Response confirmation of uHTS for the identification of UBC13 Polyubiquitin Inhibitors via a TR-FRET Assay
IC50 2451±157 nM
Citation PubChem, PC Dose Response confirmation of uHTS for the identification of UBC13 Polyubiquitin Inhibitors via a TR-FRET Assay PubChem Bioassay(2011)[AID]
 
Ubiquitin-conjugating enzyme E2 N
Name:Ubiquitin-conjugating enzyme E2 N
Type:PROTEIN
Mol. Mass.:17137.61
Organism:Homo sapiens (Human)
Description:EBI_101440
Residue:152
BDBM78848
NameBDBM78848
Synonyms:IK-LW SMR000391070 | cid_16196648
TypeSmall organic molecule
Emp. Form.C51H79ClN18O5
Mol. Mass.1059.744
SMILESCl.CCC(C)[C@H](N)c1cn(nn1)[C@@H](CCCCN)C(=O)N1CCN(CC1)c1nc(NCCOCCOCCOCC#C)nc(n1)N1CCN(CC1)C(=O)[C@H](Cc1cc2ccccc2[nH]1)n1cc(nn1)[C@@H](N)CC(C)C