Reaction Details
TargetUbiquitin-conjugating enzyme E2 N
LigandBDBM78619
Substrate/Competitorn/a
Meas. Tech.Dose Response confirmation of uHTS for the identification of UBC13 Polyubiquitin Inhibitors via a TR-FRET Assay reconfirm
IC50 947±18 nM
Citation PubChem, PC Dose Response confirmation of uHTS for the identification of UBC13 Polyubiquitin Inhibitors via a TR-FRET Assay reconfirm PubChem Bioassay(2011)[AID]
 
Ubiquitin-conjugating enzyme E2 N
Name:Ubiquitin-conjugating enzyme E2 N
Type:PROTEIN
Mol. Mass.:17137.61
Organism:Homo sapiens (Human)
Description:EBI_101440
Residue:152
BDBM78619
NameBDBM78619
Synonyms:2-amino-N'-(2,3-dimethoxybenzylidene)-4-methyl-1,3-thiazole-5-carbohydrazide 2-amino-N-[(2,3-dimethoxyphenyl)methylideneamino]-4-methyl-1,3-thiazole-5-carboxamide 2-azanyl-N-[(2,3-dimethoxyphenyl)methylideneamino]-4-methyl-1,3-thiazole-5-carboxamide SMR000162968 | cid_729197
TypeSmall organic molecule
Emp. Form.C14H16N4O3S
Mol. Mass.320.367
SMILESCOc1cccc(C=NNC(=O)c2sc(N)nc2C)c1OC