Reaction Details
TargetUbiquitin-conjugating enzyme E2 N
LigandBDBM46318
Substrate/Competitorn/a
Meas. Tech.Dose Response confirmation of uHTS for the identification of UBC13 Polyubiquitin Inhibitors via a TR-FRET Assay reconfirm
IC50 386±5 nM
Citation PubChem, PC Dose Response confirmation of uHTS for the identification of UBC13 Polyubiquitin Inhibitors via a TR-FRET Assay reconfirm PubChem Bioassay(2011)[AID]
 
Ubiquitin-conjugating enzyme E2 N
Name:Ubiquitin-conjugating enzyme E2 N
Type:PROTEIN
Mol. Mass.:17137.61
Organism:Homo sapiens (Human)
Description:EBI_101440
Residue:152
BDBM46318
NameBDBM46318
Synonyms:2-amino-4-methyl-N'-(3,4,5-trimethoxybenzylidene)-1,3-thiazole-5-carbohydrazide 2-amino-4-methyl-N-[(3,4,5-trimethoxyphenyl)methylideneamino]-1,3-thiazole-5-carboxamide 2-azanyl-4-methyl-N-[(3,4,5-trimethoxyphenyl)methylideneamino]-1,3-thiazole-5-carboxamide SMR000162971 | cid_1036441
TypeSmall organic molecule
Emp. Form.C15H18N4O4S
Mol. Mass.350.393
SMILESCOc1cc(C=NNC(=O)c2sc(N)nc2C)cc(OC)c1OC