Reaction Details
TargetUbiquitin-conjugating enzyme E2 N
LigandBDBM78669
Substrate/Competitorn/a
Meas. Tech.Dose Response confirmation of uHTS for the identification of UBC13 Polyubiquitin Inhibitors via a TR-FRET Assay reconfirm
IC50 509±44 nM
Citation PubChem, PC Dose Response confirmation of uHTS for the identification of UBC13 Polyubiquitin Inhibitors via a TR-FRET Assay reconfirm PubChem Bioassay(2011)[AID]
 
Ubiquitin-conjugating enzyme E2 N
Name:Ubiquitin-conjugating enzyme E2 N
Type:PROTEIN
Mol. Mass.:17137.61
Organism:Homo sapiens (Human)
Description:EBI_101440
Residue:152
BDBM78669
NameBDBM78669
Synonyms:1-[(2-keto-5,7-dimethyl-indol-3-yl)amino]-3-(tetrahydrofurfuryl)thiourea 1-[(5,7-dimethyl-2-oxo-3-indolyl)amino]-3-(2-oxolanylmethyl)thiourea MLS000417314 cid_5992118
TypeSmall organic molecule
Emp. Form.C16H20N4O2S
Mol. Mass.332.421
SMILESCc1cc(C)c2=NC(=O)C(NNC(=S)NCC3CCCO3)=c2c1