Reaction Details
TargetUbiquitin-conjugating enzyme E2 N
LigandBDBM72267
Substrate/Competitorn/a
Meas. Tech.Dose Response confirmation of uHTS for the identification of UBC13 Polyubiquitin Inhibitors via a TR-FRET Assay reconfirm
IC50 594±135 nM
Citation PubChem, PC Dose Response confirmation of uHTS for the identification of UBC13 Polyubiquitin Inhibitors via a TR-FRET Assay reconfirm PubChem Bioassay(2011)[AID]
 
Ubiquitin-conjugating enzyme E2 N
Name:Ubiquitin-conjugating enzyme E2 N
Type:PROTEIN
Mol. Mass.:17137.61
Organism:Homo sapiens (Human)
Description:EBI_101440
Residue:152
BDBM72267
NameBDBM72267
Synonyms:1-(3-methylphenyl)-3-[(2-oxidanylideneindol-3-yl)amino]thiourea 1-(3-methylphenyl)-3-[(2-oxoindol-3-yl)amino]thiourea 1H-indole-2,3-dione 3-[N-(3-methylphenyl)thiosemicarbazone] SMR000231438 | cid_5465946
TypeSmall organic molecule
Emp. Form.C16H14N4OS
Mol. Mass.310.374
SMILESCc1cccc(NC(=S)NNC2=c3ccccc3=NC2=O)c1