Reaction Details
TargetUbiquitin-conjugating enzyme E2 N
LigandBDBM52609
Substrate/Competitorn/a
Meas. Tech.Dose Response confirmation of uHTS for the identification of UBC13 Polyubiquitin Inhibitors via a TR-FRET Assay reconfirm
IC50 763±27 nM
Citation PubChem, PC Dose Response confirmation of uHTS for the identification of UBC13 Polyubiquitin Inhibitors via a TR-FRET Assay reconfirm PubChem Bioassay(2011)[AID]
 
Ubiquitin-conjugating enzyme E2 N
Name:Ubiquitin-conjugating enzyme E2 N
Type:PROTEIN
Mol. Mass.:17137.61
Organism:Homo sapiens (Human)
Description:EBI_101440
Residue:152
BDBM52609
NameBDBM52609
Synonyms:1-(4-hydroxyphenyl)-3-[(2-ketoindol-3-yl)amino]thiourea 1-(4-hydroxyphenyl)-3-[(2-oxo-3-indolyl)amino]thiourea 1H-indole-2,3-dione 3-[N-(4-hydroxyphenyl)thiosemicarbazone] SMR000298023 | cid_5345764
TypeSmall organic molecule
Emp. Form.C15H12N4O2S
Mol. Mass.312.346
SMILESOc1ccc(NC(=S)NNC2=c3ccccc3=NC2=O)cc1