Reaction Details
TargetUbiquitin-conjugating enzyme E2 N
LigandBDBM78849
Substrate/Competitorn/a
Meas. Tech.Dose Response confirmation of uHTS for the identification of UBC13 Polyubiquitin Inhibitors via a TR-FRET Assay reconfirm
IC50 561±37 nM
Citation PubChem, PC Dose Response confirmation of uHTS for the identification of UBC13 Polyubiquitin Inhibitors via a TR-FRET Assay reconfirm PubChem Bioassay(2011)[AID]
 
Ubiquitin-conjugating enzyme E2 N
Name:Ubiquitin-conjugating enzyme E2 N
Type:PROTEIN
Mol. Mass.:17137.61
Organism:Homo sapiens (Human)
Description:EBI_101440
Residue:152
BDBM78849
NameBDBM78849
Synonyms:1-[(2-keto-5,7-dimethyl-indol-3-yl)amino]-3-(2-methoxyethyl)thiourea 1-[(5,7-dimethyl-2-oxo-3-indolyl)amino]-3-(2-methoxyethyl)thiourea MLS000774564 cid_6073008
TypeSmall organic molecule
Emp. Form.C14H18N4O2S
Mol. Mass.306.383
SMILESCOCCNC(=S)NNC1=c2cc(C)cc(C)c2=NC1=O