Reaction Details
TargetUbiquitin-conjugating enzyme E2 N
LigandBDBM51902
Substrate/Competitorn/a
Meas. Tech.Dose Response confirmation of uHTS for the identification of UBC13 Polyubiquitin Inhibitors via a TR-FRET Assay reconfirm
IC50 10133±200 nM
Citation PubChem, PC Dose Response confirmation of uHTS for the identification of UBC13 Polyubiquitin Inhibitors via a TR-FRET Assay reconfirm PubChem Bioassay(2011)[AID]
 
Ubiquitin-conjugating enzyme E2 N
Name:Ubiquitin-conjugating enzyme E2 N
Type:PROTEIN
Mol. Mass.:17137.61
Organism:Homo sapiens (Human)
Description:EBI_101440
Residue:152
BDBM51902
NameBDBM51902
Synonyms:MLS001203758 N-[(4-fluorophenyl)methylideneamino]-6-methoxy-2-methyl-4-quinolinamine N-[(4-fluorophenyl)methylideneamino]-6-methoxy-2-methylquinolin-4-amine [(4-fluorobenzylidene)amino]-(6-methoxy-2-methyl-4-quinolyl)amine cid_3141521
TypeSmall organic molecule
Emp. Form.C18H16FN3O
Mol. Mass.309.3375
SMILESCOc1ccc2nc(C)cc(N=NCc3ccc(F)cc3)c2c1