Reaction Details
TargetUbiquitin-conjugating enzyme E2 N
LigandBDBM79117
Substrate/Competitorn/a
Meas. Tech.Dose Response confirmation of uHTS for the identification of UBC13 Polyubiquitin Inhibitors via a TR-FRET Assay reconfirm
IC50 1465±28 nM
Citation PubChem, PC Dose Response confirmation of uHTS for the identification of UBC13 Polyubiquitin Inhibitors via a TR-FRET Assay reconfirm PubChem Bioassay(2011)[AID]
 
Ubiquitin-conjugating enzyme E2 N
Name:Ubiquitin-conjugating enzyme E2 N
Type:PROTEIN
Mol. Mass.:17137.61
Organism:Homo sapiens (Human)
Description:EBI_101440
Residue:152
BDBM79117
NameBDBM79117
Synonyms:2-[(2-keto-2-pyrrolidino-acetyl)amino]-5,5-dimethyl-4,7-dihydrothieno[2,3-c]pyran-3-carboxamide 5,5-dimethyl-2-[(2-oxidanylidene-2-pyrrolidin-1-yl-ethanoyl)amino]-4,7-dihydrothieno[2,3-c]pyran-3-carboxamide MLS001158318 cid_8034751
TypeSmall organic molecule
Emp. Form.C16H21N3O4S
Mol. Mass.351.421
SMILESCC1(C)Cc2c(CO1)sc(NC(=O)C(=O)N1CCCC1)c2C(N)=O