Reaction Details
TargetUbiquitin-conjugating enzyme E2 N
LigandBDBM64465
Substrate/Competitorn/a
Meas. Tech.Dose Response confirmation of uHTS for the identification of UBC13 Polyubiquitin Inhibitors via a TR-FRET Assay reconfirm
IC50 1274±49 nM
Citation PubChem, PC Dose Response confirmation of uHTS for the identification of UBC13 Polyubiquitin Inhibitors via a TR-FRET Assay reconfirm PubChem Bioassay(2011)[AID]
 
Ubiquitin-conjugating enzyme E2 N
Name:Ubiquitin-conjugating enzyme E2 N
Type:PROTEIN
Mol. Mass.:17137.61
Organism:Homo sapiens (Human)
Description:EBI_101440
Residue:152
BDBM64465
NameBDBM64465
Synonyms:4-(3,4-dihydro-1H-isoquinolin-2-ylsulfonyl)-N-(4,7-dimethoxy-1,3-benzothiazol-2-yl)-N-[3-(dimethylamino)propyl]benzamide;hydrochloride SMR000807899 | cid_24892212
TypeSmall organic molecule
Emp. Form.C30H34N4O5S2
Mol. Mass.594.745
SMILESCOc1ccc(OC)c2sc(nc12)N(CCCN(C)C)C(=O)c1ccc(cc1)S(=O)(=O)N1CCc2ccccc2C1