Reaction Details
TargetX-box-binding protein 1
LigandBDBM22879
Substrate/Competitorn/a
Meas. Tech.XBP1 DR counterscreen for CHOP
IC50 5100±n/a nM
Citation PubChem, PC XBP1 DR counterscreen for CHOP PubChem Bioassay(2011)[AID]
 
X-box-binding protein 1
Name:X-box-binding protein 1
Type:Enzyme Catalytic Domain
Mol. Mass.:28704.14
Organism:Homo sapiens (Human)
Description:gi_47678753
Residue:261
BDBM22879
NameBDBM22879
Synonyms:(1R)-1-(4-tert-butylphenyl)-4-[4-(hydroxydiphenylmethyl)piperidin-1-yl]butan-1-ol (R)-(+)-Terfenadine cid_5405
TypeSmall organic molecule
Emp. Form.C32H41NO2
Mol. Mass.471.6734
SMILESCC(C)(C)c1ccc(cc1)[C@H](O)CCCN1CCC(CC1)C(O)(c1ccccc1)c1ccccc1