Reaction Details
TargetX-box-binding protein 1
LigandBDBM38993
Substrate/Competitorn/a
Meas. Tech.XBP1 DR counterscreen for CHOP
IC50 2630±n/a nM
Citation PubChem, PC XBP1 DR counterscreen for CHOP PubChem Bioassay(2011)[AID]
 
X-box-binding protein 1
Name:X-box-binding protein 1
Type:Enzyme Catalytic Domain
Mol. Mass.:28704.14
Organism:Homo sapiens (Human)
Description:gi_47678753
Residue:261
BDBM38993
NameBDBM38993
Synonyms:(1Z,3Z)-1,4-bis(butylsulfonyl)buta-1,3-diene SMR000020833 | cid_5286934
TypeSmall organic molecule
Emp. Form.C12H22O4S2
Mol. Mass.294.431
SMILESCCCCS(=O)(=O)\C=C/C=C\S(=O)(=O)CCCC