Reaction Details
TargetX-box-binding protein 1
LigandBDBM31068
Substrate/Competitorn/a
Meas. Tech.XBP1 DR counterscreen for CHOP
IC50 10000±n/a nM
Citation PubChem, PC XBP1 DR counterscreen for CHOP PubChem Bioassay(2011)[AID]
 
X-box-binding protein 1
Name:X-box-binding protein 1
Type:Enzyme Catalytic Domain
Mol. Mass.:28704.14
Organism:Homo sapiens (Human)
Description:gi_47678753
Residue:261
BDBM31068
NameBDBM31068
Synonyms:2-(methylsulfonyl)-4-thien-2-yl-6-(trifluoromethyl)pyrimidine 2-methylsulfonyl-4-thiophen-2-yl-6-(trifluoromethyl)pyrimidine SMR000022589 cid_3245258
TypeSmall organic molecule
Emp. Form.C10H7F3N2O2S2
Mol. Mass.308.3
SMILESCS(=O)(=O)c1nc(cc(n1)C(F)(F)F)-c1cccs1