Reaction Details
TargetX-box-binding protein 1
LigandBDBM43491
Substrate/Competitorn/a
Meas. Tech.XBP1 DR counterscreen for CHOP
IC50 910±n/a nM
Citation PubChem, PC XBP1 DR counterscreen for CHOP PubChem Bioassay(2011)[AID]
 
X-box-binding protein 1
Name:X-box-binding protein 1
Type:Enzyme Catalytic Domain
Mol. Mass.:28704.14
Organism:Homo sapiens (Human)
Description:gi_47678753
Residue:261
BDBM43491
NameBDBM43491
Synonyms:(3E,5E)-3,5-bis(3,4,5-trimethoxybenzylidene)tetrahydropyran-4-one (3E,5E)-3,5-bis[(3,4,5-trimethoxyphenyl)methylidene]oxan-4-one MLS000860258 cid_5703458
TypeSmall organic molecule
Emp. Form.C25H28O8
Mol. Mass.456.485
SMILESCOc1cc(\C=C2/COC\C(=C/c3cc(OC)c(OC)c(OC)c3)C2=O)cc(OC)c1OC