Reaction Details
TargetPerilipin-1
LigandBDBM50240379
Substrate/Competitorn/a
Meas. Tech.Luminescence-based biochemical high throughput dose response assay for inhibitors of the interaction of the lipase co-activator protein, abhydrolase domain
IC50 1520±n/a nM
Citation PubChem, PC Luminescence-based biochemical high throughput dose response assay for inhibitors of the interaction of the lipase co-activator protein, abhydrolase domain containing 5 (ABHD5) with perilipin-1 (PLIN1) (2K validation set) PubChem Bioassay(2011)[AID]
 
Perilipin-1
Name:Perilipin-1
Type:Enzyme Catalytic Domain
Mol. Mass.:55988.69
Organism:Homo sapiens (Human)
Description:gi_223718203
Residue:522
BDBM50240379
NameBDBM50240379
Synonyms:(1E,4E)-1,5-Diphenyl-penta-1,4-dien-3-one CHEMBL17201 | cid_640180
TypeSmall organic molecule
Emp. Form.C17H14O
Mol. Mass.234.2925
SMILESO=C(\C=C\c1ccccc1)/C=C/c1ccccc1