Reaction Details
TargetDNA damage-inducible transcript 3 protein
LigandBDBM38956
Substrate/Competitorn/a
Meas. Tech.CHOP dose-response primary assay
IC50<160±n/a nM
Citation PubChem, PC CHOP dose-response primary assay PubChem Bioassay(2011)[AID]
 
DNA damage-inducible transcript 3 protein
Name:DNA damage-inducible transcript 3 protein
Type:Enzyme Catalytic Domain
Mol. Mass.:19175.17
Organism:Mus musculus
Description:gi_160707929
Residue:168
BDBM38956
NameBDBM38956
Synonyms:2-({[2-(4-ethoxyphenyl)-5-methyl-1,3-oxazol-4-yl]methyl}thio)-N-(2-furylmethyl)acetamide 2-[[2-(4-ethoxyphenyl)-5-methyl-1,3-oxazol-4-yl]methylsulfanyl]-N-(furan-2-ylmethyl)ethanamide MLS000046849 SMR000032860 | cid_3237327
TypeSmall organic molecule
Emp. Form.C20H22N2O4S
Mol. Mass.386.465
SMILESCCOc1ccc(cc1)-c1nc(CSCC(=O)NCc2ccco2)c(C)o1