Reaction Details
TargetDNA damage-inducible transcript 3 protein
LigandBDBM38993
Substrate/Competitorn/a
Meas. Tech.CHOP dose-response primary assay
IC50 1920±n/a nM
Citation PubChem, PC CHOP dose-response primary assay PubChem Bioassay(2011)[AID]
 
DNA damage-inducible transcript 3 protein
Name:DNA damage-inducible transcript 3 protein
Type:Enzyme Catalytic Domain
Mol. Mass.:19175.17
Organism:Mus musculus
Description:gi_160707929
Residue:168
BDBM38993
NameBDBM38993
Synonyms:(1Z,3Z)-1,4-bis(butylsulfonyl)buta-1,3-diene SMR000020833 | cid_5286934
TypeSmall organic molecule
Emp. Form.C12H22O4S2
Mol. Mass.294.431
SMILESCCCCS(=O)(=O)\C=C/C=C\S(=O)(=O)CCCC