Reaction Details
TargetDNA damage-inducible transcript 3 protein
LigandBDBM43363
Substrate/Competitorn/a
Meas. Tech.CHOP dose-response primary assay
IC50 9930±n/a nM
Citation PubChem, PC CHOP dose-response primary assay PubChem Bioassay(2011)[AID]
 
DNA damage-inducible transcript 3 protein
Name:DNA damage-inducible transcript 3 protein
Type:Enzyme Catalytic Domain
Mol. Mass.:19175.17
Organism:Mus musculus
Description:gi_160707929
Residue:168
BDBM43363
NameBDBM43363
Synonyms:2,5-bis(chloranyl)-3-piperidin-1-yl-6-(2-piperidin-1-yl-1,3-thiazol-5-yl)cyclohexa-2,5-diene-1,4-dione 2,5-dichloro-3-(1-piperidinyl)-6-[2-(1-piperidinyl)-5-thiazolyl]cyclohexa-2,5-diene-1,4-dione 2,5-dichloro-3-piperidino-6-(2-piperidinothiazol-5-yl)-p-benzoquinone SMR000115104 | cid_406171
TypeSmall organic molecule
Emp. Form.C19H21Cl2N3O2S
Mol. Mass.426.36
SMILESClC1=C(N2CCCCC2)C(=O)C(Cl)=C(c2cnc(s2)N2CCCCC2)C1=O