Reaction Details
TargetDNA damage-inducible transcript 3 protein
LigandBDBM67862
Substrate/Competitorn/a
Meas. Tech.CHOP dose-response primary assay
IC50<160±n/a nM
Citation PubChem, PC CHOP dose-response primary assay PubChem Bioassay(2011)[AID]
 
DNA damage-inducible transcript 3 protein
Name:DNA damage-inducible transcript 3 protein
Type:Enzyme Catalytic Domain
Mol. Mass.:19175.17
Organism:Mus musculus
Description:gi_160707929
Residue:168
BDBM67862
NameBDBM67862
Synonyms:1-(2-chlorobenzyl)-N-[5-(1-ethylpropyl)-1,3,4-thiadiazol-2-yl]-3,5-dimethyl-pyrazole-4-carboxamide 1-[(2-chlorophenyl)methyl]-3,5-dimethyl-N-(5-pentan-3-yl-1,3,4-thiadiazol-2-yl)pyrazole-4-carboxamide SMR000154389 | cid_2550604
TypeSmall organic molecule
Emp. Form.C20H24ClN5OS
Mol. Mass.417.955
SMILESCCC(CC)c1nnc(NC(=O)c2c(C)nn(Cc3ccccc3Cl)c2C)s1