Reaction Details
TargetDNA damage-inducible transcript 3 protein
LigandBDBM44487
Substrate/Competitorn/a
Meas. Tech.CHOP dose-response primary assay
IC50<160±n/a nM
Citation PubChem, PC CHOP dose-response primary assay PubChem Bioassay(2011)[AID]
 
DNA damage-inducible transcript 3 protein
Name:DNA damage-inducible transcript 3 protein
Type:Enzyme Catalytic Domain
Mol. Mass.:19175.17
Organism:Mus musculus
Description:gi_160707929
Residue:168
BDBM44487
NameBDBM44487
Synonyms:2-[(5-amino-1H-1,2,4-triazol-3-yl)sulfanyl]-N-[3-cyano-5-[(E)-2-(4-ethoxyphenyl)ethenyl]-7,7-dimethyl-6H-1-benzothiophen-2-yl]acetamide 2-[(5-amino-1H-1,2,4-triazol-3-yl)thio]-N-[3-cyano-7,7-dimethyl-5-[(E)-2-p-phenetylvinyl]-6H-benzothiophen-2-yl]acetamide MLS000565542 cid_2099550
TypeSmall organic molecule
Emp. Form.C25H26N6O2S2
Mol. Mass.506.643
SMILESCCOc1ccc(\C=C\C2=Cc3c(C#N)c(NC(=O)CSc4nnc(N)[nH]4)sc3C(C)(C)C2)cc1