Reaction Details
TargetDNA damage-inducible transcript 3 protein
LigandBDBM43484
Substrate/Competitorn/a
Meas. Tech.CHOP dose-response primary assay
IC50 2450±n/a nM
Citation PubChem, PC CHOP dose-response primary assay PubChem Bioassay(2011)[AID]
 
DNA damage-inducible transcript 3 protein
Name:DNA damage-inducible transcript 3 protein
Type:Enzyme Catalytic Domain
Mol. Mass.:19175.17
Organism:Mus musculus
Description:gi_160707929
Residue:168
BDBM43484
NameBDBM43484
Synonyms:(3aR,5R,5aR,8aR,9S,9aS)-5,8a-dimethyl-1-methylidene-9-oxidanyl-3a,4,5,5a,9,9a-hexahydroazuleno[6,7-b]furan-2,8-dione (3aR,5R,5aR,8aR,9S,9aS)-9-hydroxy-5,8a-dimethyl-1-methylene-3a,4,5,5a,9,9a-hexahydroazuleno[6,7-b]furan-2,8-quinone Helenalin SMR000445626 | cid_23205
TypeSmall organic molecule
Emp. Form.C15H18O4
Mol. Mass.262.301
SMILESC[C@@H]1C[C@H]2OC(=O)C(=C)[C@H]2[C@H](O)[C@@]2(C)[C@H]1C=CC2=O