Reaction Details
TargetDNA damage-inducible transcript 3 protein
LigandBDBM43491
Substrate/Competitorn/a
Meas. Tech.CHOP dose-response primary assay
IC50 2110±n/a nM
Citation PubChem, PC CHOP dose-response primary assay PubChem Bioassay(2011)[AID]
 
DNA damage-inducible transcript 3 protein
Name:DNA damage-inducible transcript 3 protein
Type:Enzyme Catalytic Domain
Mol. Mass.:19175.17
Organism:Mus musculus
Description:gi_160707929
Residue:168
BDBM43491
NameBDBM43491
Synonyms:(3E,5E)-3,5-bis(3,4,5-trimethoxybenzylidene)tetrahydropyran-4-one (3E,5E)-3,5-bis[(3,4,5-trimethoxyphenyl)methylidene]oxan-4-one MLS000860258 cid_5703458
TypeSmall organic molecule
Emp. Form.C25H28O8
Mol. Mass.456.485
SMILESCOc1cc(\C=C2/COC\C(=C/c3cc(OC)c(OC)c(OC)c3)C2=O)cc(OC)c1OC