Reaction Details
TargetBeta-adrenergic receptor kinase 1
LigandBDBM47934
Substrate/Competitorn/a
Meas. Tech.Dose Response of inhibitors of GRK2 binding with RNA aptamer, Cherry Pick 1
EC50 3500±n/a nM
Citation PubChem, PC Dose Response of inhibitors of GRK2 binding with RNA aptamer, Cherry Pick 1 PubChem Bioassay(2011)[AID]
 
Beta-adrenergic receptor kinase 1
Name:Beta-adrenergic receptor kinase 1
Type:Enzyme
Mol. Mass.:79581.30
Organism:Homo sapiens (Human)
Description:P25098
Residue:689
BDBM47934
NameBDBM47934
Synonyms:MLS000101692 N-[2-(2-methylindol-1-yl)ethyl]thiophene-2-carboxamide cid_4349596
TypeSmall organic molecule
Emp. Form.C16H16N2OS
Mol. Mass.284.376
SMILESCc1cc2ccccc2n1CCNC(=O)c1cccs1