Reaction Details
TargetBeta-adrenergic receptor kinase 1
LigandBDBM55008
Substrate/Competitorn/a
Meas. Tech.Dose Response of inhibitors of GRK2 binding with RNA aptamer, Cherry Pick 1
EC50 70±n/a nM
Citation PubChem, PC Dose Response of inhibitors of GRK2 binding with RNA aptamer, Cherry Pick 1 PubChem Bioassay(2011)[AID]
 
Beta-adrenergic receptor kinase 1
Name:Beta-adrenergic receptor kinase 1
Type:Enzyme
Mol. Mass.:79581.30
Organism:Homo sapiens (Human)
Description:P25098
Residue:689
BDBM55008
NameBDBM55008
Synonyms:CEFSULODIN SODIUM SALT SMR000058798 sodium;(6R,7R)-3-[(4-aminocarbonylpyridin-1-ium-1-yl)methyl]-8-oxidanylidene-7-[(2-phenyl-2-sulfonato-ethanoyl)amino]-5-thia-1-azabicyclo[4.2.0]oct-2-ene-2-carboxylate sodium;(6R,7R)-3-[(4-carbamoylpyridin-1-ium-1-yl)methyl]-8-keto-7-[(2-phenyl-2-sulfonato-acetyl)amino]-5-thia-1-azabicyclo[4.2.0]oct-2-ene-2-carboxylate | sodium;(6R,7R)-3-[(4-carbamoylpyridin-1-ium-1-yl)methyl]-8-oxo-7-[(2-phenyl-2-sulfonatoacetyl)amino]-5-thia-1-azabicyclo[4.2.0]oct-2-ene-2-carboxylate
TypeSmall organic molecule
Emp. Form.C22H19N4O8S2
Mol. Mass.531.539
SMILESNC(=O)c1cc[n+](CC2=C(N3[C@H](SC2)[C@H](NC(=O)C(c2ccccc2)S([O-])(=O)=O)C3=O)C([O-])=O)cc1