Reaction Details
TargetBeta-adrenergic receptor kinase 1
LigandBDBM48719
Substrate/Competitorn/a
Meas. Tech.Dose Response of inhibitors of GRK2 binding with RNA aptamer, Cherry Pick 1
EC50 1210±n/a nM
Citation PubChem, PC Dose Response of inhibitors of GRK2 binding with RNA aptamer, Cherry Pick 1 PubChem Bioassay(2011)[AID]
 
Beta-adrenergic receptor kinase 1
Name:Beta-adrenergic receptor kinase 1
Type:Enzyme
Mol. Mass.:79581.30
Organism:Homo sapiens (Human)
Description:P25098
Residue:689
BDBM48719
NameBDBM48719
Synonyms:4-[2-[(E)-[1-[2-(4-methylanilino)-2-oxoethyl]-2,5-dioxo-4-imidazolidinylidene]methyl]-1-pyrrolyl]benzoic acid 4-[2-[(E)-[1-[2-[(4-methylphenyl)amino]-2-oxidanylidene-ethyl]-2,5-bis(oxidanylidene)imidazolidin-4-ylidene]methyl]pyrrol-1-yl]benzoic acid 4-{2-[(E)-(1-{2-[(4-methylphenyl)amino]-2-oxoethyl}-2,5-dioxoimidazolidin-4-ylidene)methyl]-1H-pyrrol-1-yl}benzoic acid SMR000207594 | cid_12004437
TypeSmall organic molecule
Emp. Form.C24H20N4O5
Mol. Mass.444.4394
SMILESCc1ccc(NC(=O)CN2C(=O)N\C(=C\c3cccn3-c3ccc(cc3)C(O)=O)C2=O)cc1