Reaction Details
TargetBeta-adrenergic receptor kinase 1
LigandBDBM61066
Substrate/Competitorn/a
Meas. Tech.Dose Response of inhibitors of GRK2 binding with RNA aptamer, Cherry Pick 1
EC50 60±n/a nM
Citation PubChem, PC Dose Response of inhibitors of GRK2 binding with RNA aptamer, Cherry Pick 1 PubChem Bioassay(2011)[AID]
 
Beta-adrenergic receptor kinase 1
Name:Beta-adrenergic receptor kinase 1
Type:Enzyme
Mol. Mass.:79581.30
Organism:Homo sapiens (Human)
Description:P25098
Residue:689
BDBM61066
NameBDBM61066
Synonyms:14-benzoylacenaphtho[1',2':4,5]pyrido[2,1-b][1,3]benzothiazol-13-ium SMR000230206 | cid_15944971
TypeSmall organic molecule
Emp. Form.C28H16BrNOS
Mol. Mass.494.402
SMILES[Br-].O=C(c1ccccc1)c1c-2c(cc3sc4ccccc4[n+]13)-c1cccc3cccc-2c13