Reaction Details
TargetBeta-adrenergic receptor kinase 1
LigandBDBM79502
Substrate/Competitorn/a
Meas. Tech.Dose Response of inhibitors of GRK2 binding with RNA aptamer, Cherry Pick 1
EC50 1940±n/a nM
Citation PubChem, PC Dose Response of inhibitors of GRK2 binding with RNA aptamer, Cherry Pick 1 PubChem Bioassay(2011)[AID]
 
Beta-adrenergic receptor kinase 1
Name:Beta-adrenergic receptor kinase 1
Type:Enzyme
Mol. Mass.:79581.30
Organism:Homo sapiens (Human)
Description:P25098
Residue:689
BDBM79502
NameBDBM79502
Synonyms:(8S)-3-[3-[(2-methyl-1-oxoprop-2-enyl)amino]phenyl]-7-(1-oxo-3,3-diphenylpropyl)-1-oxa-2,7-diazaspiro[4.4]non-2-ene-8-carboxamide (8S)-7-(3,3-diphenylpropanoyl)-3-[3-(2-methylprop-2-enoylamino)phenyl]-1-oxa-2,7-diazaspiro[4.4]non-2-ene-8-carboxamide SMR000390643 | cid_16682026
TypeSmall organic molecule
Emp. Form.C32H32N4O4
Mol. Mass.536.6209
SMILESCC(=C)C(=O)Nc1cccc(c1)C1=NOC2(C[C@H](N(C2)C(=O)CC(c2ccccc2)c2ccccc2)C(N)=O)C1