Reaction Details
TargetBeta-adrenergic receptor kinase 1
LigandBDBM53267
Substrate/Competitorn/a
Meas. Tech.Dose Response of inhibitors of GRK2 binding with RNA aptamer, Cherry Pick 1
EC50 33040±n/a nM
Citation PubChem, PC Dose Response of inhibitors of GRK2 binding with RNA aptamer, Cherry Pick 1 PubChem Bioassay(2011)[AID]
 
Beta-adrenergic receptor kinase 1
Name:Beta-adrenergic receptor kinase 1
Type:Enzyme
Mol. Mass.:79581.30
Organism:Homo sapiens (Human)
Description:P25098
Residue:689
BDBM53267
NameBDBM53267
Synonyms:4-[2-[(E)-[2,4-bis(oxidanylidene)-3-(2-oxidanylidene-2-pyrrolidin-1-yl-ethyl)-1,3-thiazolidin-5-ylidene]methyl]pyrrol-1-yl]benzoic acid 4-[2-[(E)-[2,4-dioxo-3-(2-oxo-2-pyrrolidin-1-ylethyl)-1,3-thiazolidin-5-ylidene]methyl]pyrrol-1-yl]benzoic acid 4-{2-[2,4-Dioxo-3-(2-oxo-2-pyrrolidin-1-yl-ethyl)-thiazolidin-(5E)-ylidenemethyl]-pyrrol-1-yl}-benzoic acid SMR000605630 | cid_6490291
TypeSmall organic molecule
Emp. Form.C21H19N3O5S
Mol. Mass.425.458
SMILESOC(=O)c1ccc(cc1)-n1cccc1\C=C1\SC(=O)N(CC(=O)N2CCCC2)C1=O